WebKit Bugzilla
New
Browse
Log In
×
Sign in with GitHub
or
Remember my login
Create Account
·
Forgot Password
Forgotten password account recovery
RESOLVED FIXED
56804
Remove os_win32_files variable from the GYP build
https://bugs.webkit.org/show_bug.cgi?id=56804
Summary
Remove os_win32_files variable from the GYP build
Adam Barth
Reported
2011-03-22 00:08:56 PDT
Remove os_win32_files variable from the GYP build
Attachments
Patch
(2.90 KB, patch)
2011-03-22 00:10 PDT
,
Adam Barth
no flags
Details
Formatted Diff
Diff
View All
Add attachment
proposed patch, testcase, etc.
Adam Barth
Comment 1
2011-03-22 00:10:10 PDT
Created
attachment 86431
[details]
Patch
WebKit Commit Bot
Comment 2
2011-03-22 00:44:28 PDT
Comment on
attachment 86431
[details]
Patch Rejecting
attachment 86431
[details]
from commit-queue. Failed to run "['./Tools/Scripts/webkit-patch', '--status-host=queues.webkit.org', '--bot-id=cr-jail-8', 'apply-..." exit_code: 2 Last 500 characters of output: cripts/svn-apply', u'--reviewer', u'Eric Seidel', u'--force']" exit_code: 1 Parsed 2 diffs from patch file(s). patching file Source/JavaScriptCore/ChangeLog Hunk #1 succeeded at 1 with fuzz 3. patching file Source/JavaScriptCore/JavaScriptCore.gypi Hunk #4 FAILED at 685. 1 out of 4 hunks FAILED -- saving rejects to file Source/JavaScriptCore/JavaScriptCore.gypi.rej Failed to run "[u'/mnt/git/webkit-commit-queue/Tools/Scripts/svn-apply', u'--reviewer', u'Eric Seidel', u'--force']" exit_code: 1 Full output:
http://queues.webkit.org/results/8220353
WebKit Commit Bot
Comment 3
2011-03-22 13:42:44 PDT
Comment on
attachment 86431
[details]
Patch Rejecting
attachment 86431
[details]
from commit-queue. Failed to run "['./Tools/Scripts/webkit-patch', '--status-host=queues.webkit.org', '--bot-id=cr-jail-3', 'apply-..." exit_code: 2 Last 500 characters of output: cripts/svn-apply', u'--reviewer', u'Eric Seidel', u'--force']" exit_code: 1 Parsed 2 diffs from patch file(s). patching file Source/JavaScriptCore/ChangeLog Hunk #1 succeeded at 1 with fuzz 3. patching file Source/JavaScriptCore/JavaScriptCore.gypi Hunk #4 FAILED at 685. 1 out of 4 hunks FAILED -- saving rejects to file Source/JavaScriptCore/JavaScriptCore.gypi.rej Failed to run "[u'/mnt/git/webkit-commit-queue/Tools/Scripts/svn-apply', u'--reviewer', u'Eric Seidel', u'--force']" exit_code: 1 Full output:
http://queues.webkit.org/results/8218973
Adam Barth
Comment 4
2011-03-22 14:05:13 PDT
Comment on
attachment 86431
[details]
Patch Clearing flags on attachment: 86431 Committed
r81694
: <
http://trac.webkit.org/changeset/81694
>
Adam Barth
Comment 5
2011-03-22 14:05:18 PDT
All reviewed patches have been landed. Closing bug.
Note
You need to
log in
before you can comment on or make changes to this bug.
Top of Page
Format For Printing
XML
Clone This Bug